{"text_format":"1","workbook":"xlsx","n_sheets":7,"sheets":["入力用シート","請求書","様式1号","別紙1-1","別紙1-2","別紙2","集計用（確認不要）"],"not_rendered":{"charts":0,"images":1,"macros":1,"external_links":1,"defined_names":17,"comments":3,"pivot_tables":0},"unopened":[],"bounds":{"document_bytes":16777216,"sheet_cells":100000,"rows_first":2000,"rows_last":500,"rows_between":2000,"halvings":0,"cell_chars":16384,"cell_head_chars":4096},"cells_cut":0,"cells_raw":0,"read":"whole","date_system":"1900"}

{"sheet":"入力用シート","index":0,"n_rows":539,"n_cols":22,"rows_kept":539,"cut":false,"hidden":false,"merged":[[7,1,7,2],[8,1,8,2],[11,1,11,2],[11,3,11,6],[9,3,9,6],[30,3,30,5],[22,1,22,2],[18,3,18,6],[26,1,26,2],[21,3,21,6],[19,3,19,6],[26,3,26,5],[22,3,22,6],[20,3,20,6],[29,1,29,2],[27,1,27,2],[29,3,29,5],[32,0,32,12],[4,17,4,18],[2,17,2,18],[10,3,10,6],[4,3,4,5],[7,3,7,6],[8,3,8,6],[4,1,4,2],[21,1,21,2],[18,1,18,2],[19,1,19,2],[20,1,20,2],[9,1,9,2],[10,1,10,2],[30,1,30,2],[27,3,27,5]]}
[null,"令和８年度乳幼児子育て応援事業に係る事業完了報告について"]
[null,null,null,null,null,null,null,null,null,null,null,null,null,"表示しない"]
["①","施設番号を入力してください。",null,null,null,null,null,null,null,null,null,null,null,null,null,"（受託者所在地）","（受託団体名称）","（受託代表者名）"]
[null,null,null,null,null,null,null,null,null,null,null,null,null,"施設番号","施設名称","法人住所","法人名","代表者役職","代表者氏名",null,"委任状"]
[null,"施設番号"]
[null,null,null,null,null,null,null,null,null,null,null,null,null,1,"芦屋こばと保育園","芦屋市若宮町3-17","（福）芦屋こばと福祉会","理事長","小西　理恵子",null," ","ある"]
[null,null,null,null,null,null,null,null,null,null,null,null,null,2,"幼保連携型認定こども園山手夢","芦屋市東芦屋町6番10号","（福）夢工房　","理事長","滝澤　功治",null," ","ない"]
[null,"実施施設名",null,{"$f":"IF($D$5=\"\",0,VLOOKUP($D$5,$N$6:$S$535,2,0))","v":0},{"$f":"IF(#REF!=\"\",0,VLOOKUP(#REF!,$N$6:$AE$535,2,0))","v":{"$error":"#REF!"}},null,{"$f":"IF(#REF!=\"\",0,VLOOKUP(#REF!,$N$6:$AE$535,2,0))","v":{"$error":"#REF!"}},null,null,null,null,null,null,3,"風の子保育園","伊丹市西野5丁目309-2","（福）風の子会　","理事長","村山　雅子",null," "]
[null,"受託団体名称",null,{"$f":"IF($D$5=\"\",0,VLOOKUP($D$5,$N$6:$S$535,4,0))","v":0},{"$f":"IF(#REF!=\"\",0,VLOOKUP(#REF!,$N$6:$AE$535,2,0))","v":{"$error":"#REF!"}},null,{"$f":"IF(#REF!=\"\",0,VLOOKUP(#REF!,$N$6:$AE$535,2,0))","v":{"$error":"#REF!"}},null,null,null,null,null,null,4,"あひる保育園","宝塚市安倉西3丁目1番7号","（福）あひる福祉会　あひる保育園","理事長","脇田　浩美",null," "]
[null,"受託代表者役職名",null,{"$f":"IF($D$5=\"\",0,VLOOKUP($D$5,$N$6:$S$535,5,0))","v":0},{"$f":"IF(#REF!=\"\",0,VLOOKUP(#REF!,$N$6:$AE$535,2,0))","v":{"$error":"#REF!"}},null,null,null,null,null,null,null,null,5,"宝塚さくら保育園","宝塚市高松町13-2","（福）宝塚さくら福祉会　宝塚さくら保育園","理事長","和田　縉市朗",null," "]
[null,"受託代表者氏名",null,{"$f":"IF($D$5=\"\",0,VLOOKUP($D$5,$N$6:$AE$535,6,0))","v":0},null,{"$f":"IF($D$5=\"\",0,VLOOKUP($D$5,$N$6:$AE$535,6,0))","v":0},null,null,null,null,null,null,null,6,"やまぼうし保育園","宝塚市中筋6丁目16-13","（福）萬年青友の会　やまぼうし保育園","理事長","三重野　宗隆",null," "]
[null,"受託者所在地",null,{"$f":"IF($D$5=\"\",0,VLOOKUP($D$5,$N$6:$S$535,3,0))","v":0},null,null,null,null,null,null,null,null,null,7,"なかよし保育園","豊中市寺内1-1-10","（福）愛和会　","理事長","髙岡　秀幸",null," "]
[null,null,null,null,null,null,null,null,null,null,null,null,null,8,"わかばのもり保育園","宝塚市山本西1丁目4番1号","（福）サン福祉会　わかばのもり保育園","理事長","山田　愼治",null," "]
["②","上記表に表示された実施施設名、受託団体名称・代表者職氏名・所在地に誤りがあるかないか選択してください。",null,null,null,null,null,null,null,null,null,null,null,9,"逆瀬川あゆみ保育園","静岡県浜松市中央区元城町218-26","（福）聖隷福祉事業団　逆瀬川あゆみ保育園","理事長","青木　善治",null," "]
[null,"修正がある場合は、下表に正しい情報を全て記載して下さい。（１項目だけ修正する場合でも、全項目に入力してください。）",null,null,null,null,null,null,null,null,null,null,null,10,"御殿山あゆみ保育園","静岡県浜松市中央区元城町218-26","（福）聖隷福祉事業団　御殿山あゆみ保育園","理事長","青木　善治",null," "]
[null,null,null,null,null,null,null,null,null,null,null,null,null,11,"宝塚ひよこ保育園","宝塚市美座2丁目5番7号","（福）宝塚ひよこ福祉会　宝塚ひよこ保育園","理事長","國重　真由美",null," "]
[null,null,"誤りが",null,{"$f":"IF($D$17=\"\",\"←誤りがあるかないか選択してください！\",\"\")","v":"←誤りがあるかないか選択してください！"},null,null,null,null,null,null,null,null,12,"川西みらいのもり保育園","川西市萩原台西1-299-3","（福）光会","理事長","福本　礼",null," "]
[null,null,null,null,null,{"$f":"IF($D$17=\"ある\",\"下表の全項目に正しい情報を手入力してください。\",\"\")","v":""},null,null,null,null,null,null,null,13,"つくしんぼ保育所","川西市大和東3-1-4","（特非）つくしんぼ保育所","理事長","光永　冨美江",null," "]
[null,"実施施設名",null,null,null,null,null,null,null,null,null,null,null,14,"畦野こどもの里保育園","川西市東畦野1-18-32","（福）東谷あゆみ会　","理事長","穗積　富美子",null," "]
[null,"受託団体名称",null,null,null,null,null,null,null,null,null,null,null,15,"幼保連携型認定こども園ゆうかりフレンズ","三田市狭間が丘2丁目20番地","（福）北摂福祉会　","理事長","伊地知　智子","○","④ 委任状が必要です。兵庫県保育協会のHPから様式をダウンロードして、押印の上、兵庫県保育協会あて郵送してください。"]
[null,"受託代表者役職名",null,null,null,null,null,null,null,null,null,null,null,16,"あいの保育園","三田市下相野薬師尾1460番地1","（福）三翠会","理事長","上西　真一",null," "]
[null,"受託代表者氏名",null,null,null,null,null,null,null,null,null,null,null,17,"湊川短期大学付属キッズポート保育園","三田市四ツ辻1430","（学）湊川相野学園","理事長","浅井　祐子","○","④ 委任状が必要です。兵庫県保育協会のHPから様式をダウンロードして、押印の上、兵庫県保育協会あて郵送してください。"]
[null,"受託者所在地",null,null,null,null,null,null,null,null,null,null,null,18,"認定こども園星児園 七夕","尼崎市神田北通1丁目2番地","（福）あかね","理事長","松本　真希子",null," "]
[null,null,null,null,null,null,null,null,null,null,null,null,null,19,"幼保連携型認定こども園ゆき保育園","加古川市志方町投松147番地","（福）ゆき保育園","理事長","寺島　文泰",null," "]
["③","以下項目を入力してください。",null,null,null,null,null,null,"　",null,null,null,null,20,"都台こども園","加古川市上荘町都染314-1","（福）都台福祉会","理事長","藤池　滋実",null," "]
[null,null,null,null,null,null,null,null,null,null,null,null,null,21,"宝殿保育園","加古川市東神吉町西井ノ口794-4","（福）宝殿保育園","理事長","長濱　晋介",null," "]
[null,"発行責任者名",null,"電　話　番　号",null,null,"メールアドレス",null,null,null,null,null,null,22,"日岡保育園","加古川市加古川町大野443-3","（福）日岡福祉会　","理事長","高木　豊子",null," "]
[null,null,null,null,null,null,null,null,null,null,null,null,null,23,"幼保連携型認定こども園トベラこども園","加古川市平岡町高畑621-3","（福）トベラ福祉会","理事長","竹内　千鶴子",null," "]
[null,null,null,null,null,null,null,null,null,null,null,null,null,24,"あかり保育園","加古川市山手1丁目19-5","（福）あかり福祉会　あかり保育園","理事長","磯野　直子",null," "]
[null,"担当者名",null,"電　話　番　号",null,null,"メールアドレス",null,null,null,null,null,null,25,"あいあい保育園","加古川市野口町北野41番地の1","（福）愛々福祉会　あいあい保育園","理事長","中尾　和彦",null," "]
[null,null,null,null,null,null,null,null,null,null,null,null,null,26,"幼保連携型認定こども園ピュアキューピットこども園","加古郡播磨町北本荘6丁目9番11号","（福）キューピット福祉会　","理事長","堀井　桂子",null," "]
[null,null,null,null,null,null,null,null,null,null,null,null,null,27,"加古川ひまわり保育園","加古川市加古川町溝之口754","（福）加古川ひまわり福祉会","理事長","髙橋　照雄",null," "]
[{"$f":"VLOOKUP(D5,N6:U534,8,0)","v":{"$error":"#N/A"}},null,null,null,null,null,null,null,null,null,null,null,null,28,"みのりヶ丘保育園","加古川市加古川町美乃利164番地4","（福）東播福祉会　みのりヶ丘保育園","理事長","今井　智子",null," "]
[null,null,null,null,null,null,null,null,null,null,null,null,null,29,"はとのさと保育園","加古川市加古川町南備後319番地","（福）はとのさと福祉会","理事長","尾野　義彦",null," "]
[null,null,null,null,null,null,null,null,null,null,null,null,null,30,"美保里こども園","高砂市美保里13番1号","（福）美保里福祉会","理事長","西山　雅子",null," "]
[null,null,null,null,null,null,null,null,null,null,null,null,null,31,"聖パウロこども園","高砂市阿弥陀町魚橋686番地","（福）日本聖公会　高砂福祉会","理事長","坂牛　裕","○","④ 委任状が必要です。兵庫県保育協会のHPから様式をダウンロードして、押印の上、兵庫県保育協会あて郵送してください。"]
[null,null,null,null,null,null,null,null,null,null,null,null,null,32,"さいしゅうじこども園","高砂市伊保崎5丁目7の1","（福）雙樹会","理事長","暉峻　隆涉",null," "]
[null,null,null,null,null,null,null,null,null,null,null,null,null,33,"認定こども園真浄寺保育園","高砂市伊保3丁目15番17号","（福）洗心福祉会　真浄寺保育園","理事長","井村　智眼",null," "]
[null,null,null,null,null,null,null,null,null,null,null,null,null,34,"認定こども園白兎愛育園　","高砂市荒井町千鳥2丁目23-12","（宗）荒井神社","代表役員","廣瀬　元正","○","④ 委任状が必要です。兵庫県保育協会のHPから様式をダウンロードして、押印の上、兵庫県保育協会あて郵送してください。"]
[null,null,null,null,null,null,null,null,null,null,null,null,null,35,"正蓮寺こども園","高砂市阿弥陀町魚橋1673番地1","（福）正蓮寺静蔭学園","理事長","髙谷　俊英",null," "]
[null,null,null,null,null,null,null,null,null,null,null,null,null,36,"幼保連携型認定こども園中筋保育園","高砂市中筋2丁目1-7","（福）中筋福祉会　","理事長","曽根　三千代","○","④ 委任状が必要です。兵庫県保育協会のHPから様式をダウンロードして、押印の上、兵庫県保育協会あて郵送してください。"]
[null,null,null,null,null,null,null,null,null,null,null,null,null,37,"みどり丘こども園","高砂市美保里13番1号","（福）美保里福祉会","理事長","西山　雅子",null," "]
[null,null,null,null,null,null,null,null,null,null,null,null,null,38,"バンビ第二こども園","加古郡稲美町岡916番地の1","（福）稲美福祉会　バンビ第二こども園","理事長","米田　健吾",null," "]
[null,null,null,null,null,null,null,null,null,null,null,null,null,39,"いなみ野母里こども園","加古郡稲美町野寺95-5","（福）母里福祉会","理事長","大村　哲郎","○","④ 委任状が必要です。兵庫県保育協会のHPから様式をダウンロードして、押印の上、兵庫県保育協会あて郵送してください。"]
[null,null,null,null,null,null,null,null,null,null,null,null,null,40,"加古保育園","加古郡稲美町加古2314-3","（福）加古保育所","理事長","小山　清明","○","④ 委任状が必要です。兵庫県保育協会のHPから様式をダウンロードして、押印の上、兵庫県保育協会あて郵送してください。"]
[null,null,null,null,null,null,null,null,null,null,null,null,null,41,"播磨保育園","加古郡播磨町東本荘1丁目13番7号","（福）播磨福祉会","理事長","髙島　安郎",null," "]
[null,null,null,null,null,null,null,null,null,null,null,null,null,42,"キューピットこども園","加古郡播磨町北本荘6丁目9番11号","（福）キューピット福祉会","理事長","堀井　桂子","○","④ 委任状が必要です。兵庫県保育協会のHPから様式をダウンロードして、押印の上、兵庫県保育協会あて郵送してください。"]
[null,null,null,null,null,null,null,null,null,null,null,null,null,43,"播磨中央こども園","加古郡播磨町南大中1丁目5番13号","（福）八重桜会　播磨中央こども園","理事長","藤原　進",null," "]
[null,null,null,null,null,null,null,null,null,null,null,null,null,44,"蓮池こども園","明石市和坂1丁目15番1号","（福）和坂福祉会　","理事長","林谷　文子",null," "]
[null,null,null,null,null,null,null,null,null,null,null,null,null,45,"なすみ保育所","明石市魚住町清水353","（福）なすみ保育所","理事長","中林　加代子",null," "]
[null,null,null,null,null,null,null,null,null,null,null,null,null,46,"山手台こども園","明石市大久保町山手台3丁目5番地","（福）山手台保育所","理事長","三木　則夫",null," "]
[null,null,null,null,null,null,null,null,null,null,null,null,null,47,"明舞保育園","明石市朝霧南町2丁目228","（福）協和保育協会","理事長","佐藤　則子","○","④ 委任状が必要です。兵庫県保育協会のHPから様式をダウンロードして、押印の上、兵庫県保育協会あて郵送してください。"]
[null,null,null,null,null,null,null,null,null,null,null,null,null,48,"稲爪保育園","明石市大蔵本町6-10","（福）稲爪保育園","理事長","菅谷　誠夫","○","④ 委任状が必要です。兵庫県保育協会のHPから様式をダウンロードして、押印の上、兵庫県保育協会あて郵送してください。"]
[null,null,null,null,null,null,null,null,null,null,null,null,null,49,"認定こども園大久保保育園","明石市大久保町大窪1865の7番地","（福）大久保保育園","理事長","本谷　慎輔",null," "]
[null,null,null,null,null,null,null,null,null,null,null,null,null,50,"金ケ崎北保育園","明石市大久保町江井島1340","（福）福栄会　金ケ崎北保育園","理事長","福井　千恵子",null," "]
[null,null,null,null,null,null,null,null,null,null,null,null,null,51,"福田保育園","明石市大久保町江井島1340","（福）福栄会","理事長","福井　千恵子","○","④ 委任状が必要です。兵庫県保育協会のHPから様式をダウンロードして、押印の上、兵庫県保育協会あて郵送してください。"]
[null,null,null,null,null,null,null,null,null,null,null,null,null,52,"西明石愛児園","明石市藤江889番地","（福）西明石愛児園","理事長","三木　紀子",null," "]
[null,null,null,null,null,null,null,null,null,null,null,null,null,53,"幼保連携型認定こども園和坂こども園","明石市和坂1丁目15番1号","（福）和坂福祉会","理事長","林谷　文子",null," "]
[null,null,null,null,null,null,null,null,null,null,null,null,null,54,"まどかこども園","明石市大久保町大窪347-1","（福）まどか福祉会","理事長","荒井　修一郎",null," "]
[null,null,null,null,null,null,null,null,null,null,null,null,null,55,"幼保連携型認定こども園ゆたかこども園","明石市藤江756番地1","（福）ゆたか福祉会　","理事長","川本　哲三郎",null," "]
{"$rows_left_out":480}
{"sheet":"請求書","index":1,"n_rows":33,"n_cols":9,"rows_kept":33,"cut":false,"hidden":false,"merged":[[49,1,49,6],[22,2,22,5],[31,2,31,7],[23,2,23,8],[32,2,32,7],[46,1,46,6],[47,1,47,6],[15,6,15,7],[26,2,26,7],[27,2,27,7],[28,2,28,7],[30,2,30,7]]}
[null,"（入力不要・確認のみ）"]
["　・　この様式は入力していただく必要はありません。「入力用シート」に必要項目を入力いただければ自動的に"]
["　　転記されるよう数式を設定してあります。必ず「入力用シート」に必要項目を入力してください。"]
[]
[]
[null,null,null,null,null,null,null,null,{"$f":"入力用シート!D5","v":0}]
["（様式２号）"]
[]
["　　　　　　　　　　　　　　　　　　　　　　　　　　　　",null,null," 請　　求　　書"]
[]
[null,null,null,"金",{"$f":"'別紙1-2'!B10","v":{"$error":"#N/A"}},"円"]
[]
[]
[null,"　　ただし、令和８年度乳幼児子育て応援事業委託料として、上記のとおり請求します。"]
[]
[null,null,null,null,null,null,"2027-04-10"]
[]
[]
[]
[]
[null,"兵庫県知事　様"]
[]
[null,"請　求　者　住　所　",{"$f":"IF(入力用シート!$D$17=\"ある\",入力用シート!$D$23,入力用シート!$D$12)","v":0}]
[null,"　　　　　　名　称",{"$f":"IF(入力用シート!$D$17=\"ある\",入力用シート!$D$20,入力用シート!$D$9)","v":0},{"$f":"IF(入力用シート!E27=\"ある\",入力用シート!#REF!,入力用シート!E20)","v":0},{"$f":"IF(入力用シート!F27=\"ある\",入力用シート!#REF!,入力用シート!F20)","v":0},{"$f":"IF(入力用シート!G27=\"ある\",入力用シート!#REF!,入力用シート!G20)","v":0},{"$f":"IF(入力用シート!H26=\"ある\",入力用シート!H31,入力用シート!H20)","v":0},{"$f":"IF(入力用シート!I26=\"ある\",入力用シート!I31,入力用シート!I20)","v":0},{"$f":"IF(入力用シート!J26=\"ある\",入力用シート!J31,入力用シート!J20)","v":0}]
[null,"　　　　　　代表者",{"$f":"IF(入力用シート!$D$17=\"ある\",入力用シート!$D$21,入力用シート!$D$10)","v":0},null,{"$f":"IF(入力用シート!$D$17=\"ある\",入力用シート!$D$22,入力用シート!$D$11)","v":0}]
[]
[null,"発行責任者　氏　名　",{"$f":"入力用シート!B28","v":0}]
[null,"　　　　　　電　話　",{"$f":"入力用シート!D28","v":0}]
[null,"　　　　　　メール　",{"$f":"入力用シート!G28","v":0}]
[]
[null,"担　当　者　氏　名　",{"$f":"入力用シート!B31","v":0}]
[null,"　　　　　　電　話　",{"$f":"入力用シート!D31","v":0}]
[null,"　　　　　　メール　",{"$f":"入力用シート!G31","v":0}]

{"sheet":"様式1号","index":2,"n_rows":42,"n_cols":11,"rows_kept":42,"cut":false,"hidden":false,"merged":[[8,8,8,10],[12,6,12,10],[14,6,14,10],[46,1,46,11],[16,2,16,10],[47,1,47,11],[49,1,49,11],[20,6,20,11],[43,1,43,11],[44,1,44,11],[45,1,45,11]]}
[null,"（入力不要・確認のみ）"]
["　・　この様式は入力していただく必要はありません。「入力用シート」に必要項目を入力いただければ自動的に"]
["　　転記されるよう数式を設定してあります。必ず「入力用シート」に必要項目を入力してください。"]
[]
[]
[null,null,null,null,null,null,null,null,null,null,{"$f":"入力用シート!D5","v":0}]
["（様式１号）"]
[]
["　　　　　　　　　　　　　　　　　　　　　　　　　　　　",null,null,null,null,null,null,null,{"$f":"請求書!G16","v":"2027-04-10"}]
[]
["　兵 庫 県 知 事　　 様"]
[]
[]
[]
[null,"（受託者所在地）",{"$f":"IF(入力用シート!$D$17=\"ある\",入力用シート!$D$23,入力用シート!$D$12)","v":0}]
[]
[null,"（受託団体名称）",{"$f":"IF(入力用シート!$D$17=\"ある\",入力用シート!$D$20,入力用シート!$D$9)","v":0},{"$f":"IF(入力用シート!E19=\"ある\",入力用シート!E24,入力用シート!E13)","v":0},{"$f":"IF(入力用シート!F19=\"ある\",入力用シート!F24,入力用シート!F13)","v":0},{"$f":"IF(入力用シート!G19=\"ある\",入力用シート!G24,入力用シート!G13)","v":0},{"$f":"IF(入力用シート!H19=\"ある\",入力用シート!H24,入力用シート!H13)","v":0},{"$f":"IF(入力用シート!I19=\"ある\",入力用シート!I24,入力用シート!I13)","v":0},{"$f":"IF(入力用シート!J19=\"ある\",入力用シート!J24,入力用シート!J13)","v":0}]
[]
[null,"（受託代表者職氏名）",{"$f":"IF(入力用シート!$D$17=\"ある\",入力用シート!$D$21,入力用シート!$D$10)","v":0},null,{"$f":"IF(入力用シート!$D$17=\"ある\",入力用シート!$D$22,入力用シート!$D$11)","v":0}]
[]
[]
[]
[null,null,"令和８年度乳幼児子育て応援事業完了報告書"]
[]
[]
[null,"　　　　　　標記の事業が完了しましたので、下記の関係書類を添えて提出します。"]
[]
[]
[]
[]
[null,null,null,null,"記"]
[]
[]
["１","委託料精算調書（別紙１関係）"]
[null," (１)委託料精算調書(総括表) ・・・・別紙１－１"]
[null," (２)箇所別明細書 ・・・・・別紙１－２"]
[]
["２","事業実施状況報告書（別紙２関係）"]
[null," (３)乳幼児子育て応援事業 ・・・・・別紙２"]
[]
["   "]
["３","その他参考となるもの"]

{"sheet":"別紙1-1","index":3,"n_rows":21,"n_cols":7,"rows_kept":21,"cut":false,"hidden":false,"merged":[[42,1,42,11],[43,1,43,11],[45,1,45,11],[8,8,8,10],[19,1,19,5]]}
[null,"（入力不要・確認のみ）"]
["　・　この様式は入力していただく必要はありません。「入力用シート」に必要項目を入力いただければ自動的に"]
["　　転記されるよう数式を設定してあります。必ず「入力用シート」に必要項目を入力してください。"]
[]
[]
[]
["（別紙１－１）",null,null,null,null,null,{"$f":"入力用シート!D5","v":0}]
[]
["　　　　　　　　　　　　　　　　　　　　　　　　　　　　"]
[null,"委託料精算調書（総括表）"]
[null,null,null,null,null,"（単位：円）"]
[null,"事業名","契約金額","実績額","実績内訳","備考"]
[null,"乳幼児子育て応援事業",{"$f":"'別紙1-2'!B10","v":{"$error":"#N/A"}},{"$f":"'別紙1-2'!B13","v":{"$error":"#N/A"}},"別紙１－２の\nとおり"]
[]
[null,"　令和８年度乳幼児子育て応援事業の実施にかかる収支決算については、上記のとおり"]
[null,"相違はありません。"]
[]
[null,null,null,null,null,{"$f":"請求書!G16","v":"2027-04-10"}]
[]
[null,{"$f":"IF(入力用シート!$D$17=\"ある\",入力用シート!$D$20,入力用シート!$D$9)","v":0},{"$f":"IF(入力用シート!D22=\"ある\",入力用シート!D27,入力用シート!D16)","v":0},{"$f":"IF(入力用シート!E22=\"ある\",入力用シート!E27,入力用シート!E16)","v":0},{"$f":"IF(入力用シート!F22=\"ある\",入力用シート!F27,入力用シート!F16)","v":0},{"$f":"IF(入力用シート!G22=\"ある\",入力用シート!G27,入力用シート!G16)","v":0}]
[null,null,null,null,{"$f":"IF(入力用シート!$D$17=\"ある\",入力用シート!$D$21,入力用シート!$D$10)","v":0},{"$f":"IF(入力用シート!$D$17=\"ある\",入力用シート!$D$22,入力用シート!$D$11)","v":0}]

{"sheet":"別紙1-2","index":4,"n_rows":29,"n_cols":16,"rows_kept":29,"cut":false,"hidden":false,"merged":[[18,3,18,7],[19,3,19,7],[20,3,20,7],[21,3,21,7],[22,3,22,7],[3,0,3,7],[15,3,15,7],[28,0,28,7],[10,0,11,0],[8,3,8,7],[11,3,11,7],[12,3,12,7],[26,3,26,7],[25,3,25,7],[16,3,16,7],[8,1,8,2],[15,1,15,2],[17,3,17,7],[5,4,5,7],[24,3,24,7],[23,3,23,7]]}
["・黄色セルに入力してください"]
[]
["（別紙１－２）",null,null,null,null,null,"実施施設番号：",{"$f":"入力用シート!D5","v":0}]
["箇所別明細書（令和８年度乳幼児子育て応援事業）"]
[]
["法人名: ",{"$f":"IF(入力用シート!$D$17=\"ある\",入力用シート!$D$20,入力用シート!$D$9)","v":0},null,"施設名：",{"$f":"IF(入力用シート!$D$17=\"ある\",入力用シート!$D$19,入力用シート!$D$8)","v":0}]
[]
["（収入）"]
["科　目","金　 額",null,"内　 訳",null,null,null,null,null,null,null,null,null,null,"実施回数","金額"]
["委託料",{"$f":"VLOOKUP(F10,O10:P13,2,FALSE)","v":{"$error":"#N/A"}},"円","委託料","実施回数",null,"回",null,null,null,null,null,null,null,48,595000]
["その他収入",0,"円","参加費　＠","　    ","円　×",null,"名",null,null,null,null,null,null,96,1190000]
[null,0,"円","施設補てん",null,null,null,null,null,null,null,null,null,null,"48税込",655000]
["合　計",{"$f":"SUM(B10:B12)","v":{"$error":"#N/A"}},"円",null,null,null,null,null,null,null,null,null,null,null,"96税込",1310000]
[]
["（支出）"]
["科　目","金　 額",null,"内 　訳"]
["賃　金",0,"円","加配保育士賃金"]
["消耗品費",0,"円"]
["光熱水費",null,"円"]
["印刷製本費",0,"円"]
["食料費",0,"円"]
["通信運搬費",0,"円"]
["講師旅費　　及び謝金",0,"円"]
["使用料　　　及び賃借料",0,"円"]
["備品購入費",0,"円"]
["その他経費",0,"円"]
["合計",{"$f":"SUM(B17:B26)","v":0},"円"]
["収入合計－支出合計",{"$f":"B13-B27","v":{"$error":"#N/A"}}]
["(参考)保育材料の内、製作材料等の消耗品に該当するものは消耗品費に区分してください。\n主に本事業以外で使用した備品は対象となりません。"]

{"sheet":"別紙2","index":5,"n_rows":227,"n_cols":14,"rows_kept":227,"cut":false,"hidden":false,"merged":[[40,1,40,4],[40,9,40,11],[8,7,8,12],[8,13,9,13],[9,1,9,4],[38,0,38,13],[39,0,39,5],[39,6,40,6],[39,7,39,12],[39,13,40,13],[34,0,34,4],[34,7,34,11],[35,0,35,4],[35,7,35,11],[37,0,37,13],[9,8,9,11],[70,1,70,13],[71,1,71,13],[65,0,65,4],[65,7,65,11],[66,0,66,4],[66,7,66,11],[68,1,68,13],[69,1,69,13],[4,7,4,10],[2,0,2,13],[3,0,3,13],[4,0,4,4],[5,0,5,4],[4,5,4,6],[4,11,4,13],[5,7,5,13],[5,5,5,6],[6,0,6,4],[6,5,6,13],[7,0,7,4],[7,5,7,13],[8,0,8,5],[8,6,9,6],[101,0,101,4],[101,7,101,11],[102,0,102,4],[102,7,102,11],[73,0,73,13],[74,0,74,13],[75,0,75,5],[75,6,76,6],[75,7,75,12],[75,13,76,13],[76,1,76,4],[76,9,76,11],[132,0,132,4],[132,7,132,11],[133,0,133,4],[133,7,133,11],[105,0,105,13],[106,0,106,5],[106,6,107,6],[106,7,106,12],[106,13,107,13],[107,1,107,4],[107,9,107,11],[136,0,136,13],[137,0,137,5],[137,6,138,6],[137,7,137,12],[137,13,138,13],[138,1,138,4],[138,9,138,11],[169,9,169,11],[163,0,163,4],[163,7,163,11],[164,0,164,4],[164,7,164,11],[226,0,226,4],[226,7,226,11],[198,0,198,13],[199,0,199,5],[199,6,200,6],[199,7,199,12],[199,13,200,13],[200,1,200,4],[200,9,200,11],[197,0,197,13],[166,0,166,13],[135,0,135,13],[104,0,104,13],[225,0,225,4],[225,7,225,11],[194,0,194,4],[194,7,194,11],[195,0,195,4],[195,7,195,11],[167,0,167,13],[168,0,168,5],[168,6,169,6],[168,7,168,12],[168,13,169,13],[169,1,169,4]]}
["・黄色い部分を入力してください。"]
[null,null,null,null,null,null,null,null,null,null,null,null,null,{"$f":"入力用シート!$D$5&\"-1\"","v":"-1"}]
["（別紙２）"]
["乳幼児子育て応援事業実施状況（施設別）"]
["法人名",null,null,null,null,{"$f":"IF(入力用シート!$D$17=\"ある\",入力用シート!$D$20,入力用シート!$D$9)","v":0},{"$f":"IF(入力用シート!$D$17=\"ある\",入力用シート!$D$20,入力用シート!$D$9)","v":0},"施設名",null,null,null,{"$f":"IF(入力用シート!$D$17=\"ある\",入力用シート!$D$19,入力用シート!$D$8)","v":0}]
["利用者負担金",null,null,null,null,null,null,"有りの場合：１人あたり（　　　　　　）円　※１"]
["開設日",null,null,null,null,"　毎週（　　）曜日　・　毎月（　　）回　　　　　　　　　　　　　　　　　※２"]
["開設時間帯",null,null,null,null,"　　　　　：　　　～　　　：　　"]
["開催状況",null,null,null,null,null,"体験活動事業内容\n（該当番号を記載）\n①子育て相談\n②親子遊び\n③体験保育\n④保護者研修\n⑤読み聞かせ\n⑥園庭開放　　　　　\n⑦児童別室預かり　　　　\n⑧その他（ 　    　   　）","開催状況",null,null,null,null,null,"体験活動事業内容\n（該当番号を記載）\n①子育て相談\n②親子遊び\n③体験保育\n④保護者研修\n⑤読み聞かせ\n⑥園庭開放　　　　　\n⑦児童別室預かり　　　\n⑧その他（ 　    　   　）"]
["回数","開催日",null,null,null,"参加\n人数\n※３",null,"回数","開催日",null,null,null,"参加\n人数"]
[1,null,"月",null,"日",null,null,25,null,"月",null,"日"]
[2,null,"月",null,"日",null,null,26,null,"月",null,"日"]
[3,null,"月",null,"日",null,null,27,null,"月",null,"日"]
[4,null,"月",null,"日",null,null,28,null,"月",null,"日"]
[5,null,"月",null,"日",null,null,29,null,"月",null,"日"]
[6,null,"月",null,"日",null,null,30,null,"月",null,"日"]
[7,null,"月",null,"日",null,null,31,null,"月",null,"日"]
[8,null,"月",null,"日",null,null,32,null,"月",null,"日"]
[9,null,"月",null,"日",null,null,33,null,"月",null,"日"]
[10,null,"月",null,"日",null,null,34,null,"月",null,"日"]
[11,null,"月",null,"日",null,null,35,null,"月",null,"日"]
[12,null,"月",null,"日",null,null,36,null,"月",null,"日"]
[13,null,"月",null,"日",null,null,37,null,"月",null,"日"]
[14,null,"月",null,"日",null,null,38,null,"月",null,"日"]
[15,null,"月",null,"日",null,null,39,null,"月",null,"日"]
[16,null,"月",null,"日",null,null,40,null,"月",null,"日"]
[17,null,"月",null,"日",null,null,41,null,"月",null,"日"]
[18,null,"月",null,"日",null,null,42,null,"月",null,"日"]
[19,null,"月",null,"日",null,null,43,null,"月",null,"日"]
[20,null,"月",null,"日",null,null,44,null,"月",null,"日"]
[21,null,"月",null,"日",null,null,45,null,"月",null,"日"]
[22,null,"月",null,"日",null,null,46,null,"月",null,"日"]
[23,null,"月",null,"日",null,null,47,null,"月",null,"日"]
[24,null,"月",null,"日",null,null,48,null,"月",null,"日"]
["①小計(1～24回目)",null,null,null,null,{"$f":"SUM(F11:F34)","v":0},null,"②小計(25～48回目)",null,null,null,null,{"$f":"SUM(M11:M34)","v":0}]
[null,null,null,null,null,null,null,"①＋②合計(1～48回目)",null,null,null,null,{"$f":"SUM(F35+M35)","v":0}]
[null,null,null,null,null,null,null,null,null,null,null,null,null,{"$f":"入力用シート!$D$5&\"-2\"","v":"-2"}]
["（別紙2）"]
["乳幼児子育て応援事業実施状況（施設別）"]
["開催状況",null,null,null,null,null,"体験活動事業内容\n（該当番号を記載）\n①子育て相談\n②親子遊び\n③体験保育\n④保護者研修\n⑤読み聞かせ\n⑥園庭開放　　　　　\n⑦児童別室預かり　　　　⑧その他（ 　    　   　）","開催状況",null,null,null,null,null,"体験活動事業内容\n（該当番号を記載）\n①子育て相談\n②親子遊び\n③体験保育\n④保護者研修\n⑤読み聞かせ\n⑥園庭開放　　　　　\n⑦児童別室預かり　　　　\n⑧その他（ 　    　   　）"]
["回数","開催日",null,null,null,"参加\n人数",null,"回数",null,"開催日",null,null,"参加\n人数"]
[49,null,"月",null,"日",null,null,73,null,"月",null,"日"]
[50,null,"月",null,"日",null,null,74,null,"月",null,"日"]
[51,null,"月",null,"日",null,null,75,null,"月",null,"日"]
[52,null,"月",null,"日",null,null,76,null,"月",null,"日"]
[53,null,"月",null,"日",null,null,77,null,"月",null,"日"]
[54,null,"月",null,"日",null,null,78,null,"月",null,"日"]
[55,null,"月",null,"日",null,null,79,null,"月",null,"日"]
[56,null,"月",null,"日",null,null,80,null,"月",null,"日"]
[57,null,"月",null,"日",null,null,81,null,"月",null,"日"]
[58,null,"月",null,"日",null,null,82,null,"月",null,"日"]
[59,null,"月",null,"日",null,null,83,null,"月",null,"日"]
[60,null,"月",null,"日",null,null,84,null,"月",null,"日"]
[61,null,"月",null,"日",null,null,85,null,"月",null,"日"]
[62,null,"月",null,"日",null,null,86,null,"月",null,"日"]
[63,null,"月",null,"日",null,null,87,null,"月",null,"日"]
[64,null,"月",null,"日",null,null,88,null,"月",null,"日"]
[65,null,"月",null,"日",null,null,89,null,"月",null,"日"]
[66,null,"月",null,"日",null,null,90,null,"月",null,"日"]
[67,null,"月",null,"日",null,null,91,null,"月",null,"日"]
{"$rows_left_out":168}
{"sheet":"集計用（確認不要）","index":6,"n_rows":2,"n_cols":20,"rows_kept":2,"cut":false,"hidden":false,"merged":[]}
["実施施設番号","施設名称","担当者\nメールアドレス","実施回数","参加人数","委託料","その他収入","収入合計","賃金","消耗品費","光熱水費","印刷製本費","食料費","通信運搬費","講師旅費\n及び謝金","使用料　　　　　　　　及び賃借料","備品購入費","その他\n経費","支出合計","情報の修正の\n有無"]
[{"$f":"入力用シート!D5","v":0},{"$f":"IF(入力用シート!$D$17=\"ある\",入力用シート!$D$19,入力用シート!$D$8)","v":0},{"$f":"入力用シート!G31","v":0},{"$f":"'別紙1-2'!F10","v":0},{"$f":"'別紙1-2'!G11","v":0},{"$f":"'別紙1-2'!B10","v":{"$error":"#N/A"}},{"$f":"'別紙1-2'!B11+'別紙1-2'!B12","v":0},{"$f":"'別紙1-2'!B13","v":{"$error":"#N/A"}},{"$f":"'別紙1-2'!B17","v":0},{"$f":"'別紙1-2'!B18","v":0},{"$f":"'別紙1-2'!B19","v":0},{"$f":"'別紙1-2'!B20","v":0},{"$f":"'別紙1-2'!B21","v":0},{"$f":"'別紙1-2'!B22","v":0},{"$f":"'別紙1-2'!B23","v":0},{"$f":"'別紙1-2'!B24","v":0},{"$f":"'別紙1-2'!B25","v":0},{"$f":"'別紙1-2'!B26","v":0},{"$f":"'別紙1-2'!B27","v":0},{"$f":"入力用シート!D17","v":0}]